Follow us on:

Npm run start error

npm run start error js, npm, reactjs, web-deployment I tried looking it up on older posts and I’ve tried the usual reinstall modules/clean npm cache. It looks like your package. 3. npmjs. sh Invalid MIT-MAGIC-COOKIE-1 key npm ERR! npm ERR! Make sure you have the latest version of node. json. 1. 9. 0 start: react-scripts start npm ERR! Exit status 1 npm ERR! npm ERR! Failed at the blog@0. js 8. 0. Reproducible Demo Type “npm” and enter command should execute successfully and find the solution for “The term 'npm' is not recognized as the name of a cmdlet, function, script file, or operable program. js --host 0. json configuration. Exit status 126 npm ERR! npm ERR! Failed at the callcenter@0. 0. 0 start script. When I edit one of the partials that's referenced in site. npm run-script <command Try npm run serve at the console instead of npm run build. 7. 9600 npm ERR! argv “C:\Program Files odejs\ ode. https://docs. exe (npm run-script uses it by default) does not support the &. 1. Does this fix yours too? Windows_NT 10. Note : this script is not available on Windows. And then you can run npm start again, and voila : Fiko Borizqy. Usually, this error comes when npm commands are running and package. Workspaces support You may use the workspace or workspaces configs in order to run an arbitrary command from a package's "scripts" object in the context of the specified workspaces. 1. js:32:9) npm ERR [1] npm run theme exited with code 1 npm ERR! code ELIFECYCLE npm ERR! errno 1 npm ERR! quickapp-pro@2. There is likely additional logging output above. When you issue the command npm start from the root directory of your nodejs project, node will look for a scripts object in your package. Note that installing grunt-cli does not install the Grunt task runner! The job of the Grunt CLI is simple: run the version of Grunt which has been installed next to a Gruntfile. There is likely additional logging output above. I get the following error: This tutorial is dedicated to some of the common errors that you can encounter while working with npm. html file? Though the output is a static page, it needs to be viewed via a webserver. If you try to run a script without having a node_modules directory and it fails, you will be given a warning to run npm install, just in case you've forgotten. 0 test: `echo "Error: no test specified" && exit 1` npm ERR! Exit status 1 npm ERR! npm ERR! Most people are aware that is is possible to define scripts in package. If no start script is specified, then it will run “node server. 2. 1 install script. 7. Now that you're in the correct directory, you can run all the npm commands correctly without running into any errors. For more information, read this Sip. json file of the project, and we can see that there are two operations listed inside the “scripts” i. npm ERR! This is probably not a problem with npm. travis. 1:1336/browserify-test - Currently not working due to a bug with browserify (see pull request #66 for details). Issue the command live-server in your project's directory. To install it you need: Node. com/misc/scripts#default-values. To install the package, run npm install --save @progress/kendo-ui. The only thing that works is the SKIP_PREFLIGHT_CHECK=true in my . js packages, or modules if you like. js:151:19) 4 verbose stack at /usr/local/lib/node_modules/npm/lib/run-script. (Run npm update --save. Delete the node_modules folder, then re-run npm i (this is short for npm install). Displays the npm root. npm. PS D:\Qa_portal\qa-portal> npm start. json file is there. 9. 0 start script. If you don't, make sure to run npm init or yarn init beforehand. Fiko Borizqy. Active Oldest Votes. 0 start: `react-scripts start` npm ERR! Exit status 1 npm ERR! npm ERR! Failed at the photo-gallery@0. json, choose 'Show npm scripts'; in NPM tool window right-click 'start' script, choose 'Edit settings' - run configuration will be created >It only has "run-script," which throws an error. config. js node:internal/modules/cjs/loader:928 throw err; ^ Error: Cannot find module 'dotenv' Require stack: - /home/williamw/company Admin/server. Change that to node app. npm ERR! This is probably not a problem with npm. npm help npm-stop. I have an existing server with subdomain pointing to next. 1 start script. I able to run only the react server and not the api server. 0. 0 start: SINGLE_START=modeler npm run dev npm ERR! Exit status 1 npm ERR! npm ERR! Failed at the bpmn-js@8. npm ERR! Tell the author that this fails on your system: npm ERR! Exit status 1 npm ERR! npm ERR! Failed at the sqlite3@5. 9. json file. Please let me know the result of your test and which service fail to start. Overview. 0 or later installed. npm ERR! code ELIFECYCLE npm ERR! errno 1 This is error is only come when we outside the project and try to npm start just make sure you are in the correct folder double-check where package. 3. 0. Once NPM uninstalls the package, you can verify it by looking at the content of /node_modules/ directory or type the following command − $ npm ls Updating a Module. json (Runs npm uninstall --save. In this article, we will see how to resolve the npm start script missing error. npm ERR! Make sure you have the latest version of node. Node Package Manager (npm) is the package management tool included with every Node. js:332:16) This, at least allowed me to run the basic npm commands without 404 errors. js file in the root of your package, then npm will default the start command to node server. what error? What configuration did you try? Exit status 1 npm ERR! npm ERR! Failed at the test-test@0. In the NPM Script dialog that opens, specify the npm run/debug configuration settings . Search a package name using NPM. They are While this compiles my CSS file when I first run npm run watch-less, afterwards (while watching) it only compiles the CSS file when I edit site. js:960 throw err; ^ Error: Cannot find module 'C:\Users\Rudra ode_modules\create-react-app\index. I created procfile and updated package. internal/modules/cjs/loader. 450. any idea can solve this problem? OS : ubuntu 18. 0. Install and run Azurite by using NPM This installation method requires that you have Node. npm ERR! This is probably not a problem with npm. Expected behavior npm install should install all the modules and end with 'ok'. In order to do so, you need to: Press the Windows Logo key + R to open a Run ; Type services. Install Python2 * if not installed already. 22 v pm2 : 4. running scripts in parallel works on Windows; multiple scripts which are listening to file changes can run parallel react: npm startelectron: node src/electron-wait-react . . Lo mejor es hacer una reinstalación a una versión estable. js like: var config = require (". 0. 1 npm ERR! npm v2. npm ERR! code ELIFECYCLE npm ERR! errno 2 npm ERR! SpurtCommerce@3. 4. You had a network error while running npm install. org I did ti and got "Error: no test specified" when Executing task: npm run test and when npm run start: Server running at localhost:60916 - configured port 1995 could not be used. There is likely additional logging output above. When used as a dependency manager for a local project, npm can install, in one command, all the dependencies of a project through the package. This allows multiple versions of Grunt to be npm install npm-run-all — save-dev After installation of the package we have to navigate to the package. It will show “missing script: lalala”. 1. js yourself to confirm the problem is not with npm. 0. when im trying to intall npm via powershell it showing me error as [spoiler]npm : The term ‘npm’ is not recognized as the name of a cmdlet, function, script file, or operable program. 1. 7 npm ERR! npm v2. I checked my etc/host and that is properly formatted also can ping localhost successfully in my terminal. npm start uses the start command in the scripts section of package. js users are using it on Windows, so the use of & might block It should be noted that the "restart" script is run along with the "stop" and "start" scripts, and not instead of them. tsx When I run npm run build npm run start on either my local machine or my VPS, the outlined input component appears like this: The label is appearing above the input, whereas it should be […] If you type npm start and get the npm err! missing script: start error, there must be a missing line in the script object located in your package. com. /src/test/run-tests. Uninstall npm Package(s) Uninstalls the package and removes it from package. That downgrading the privileges causes this error. js" } Now, we don’t need to manually use node App. For header-test, run server. If we want to create a script name other than start like − “dev”: “node App. When you save a file while npm start is running, the browser should refresh with the updated code. To solve this problem, you need to connect your PC to the internet to download or install all packages from the server. it's all fine. ) npm install -g grunt-cli. js. 0 start script. You can run the application generator with the npx command (available in Node. 0. Build Node yourself and install it somewhere writable with lots of space. You can run the Node. 3. 6:20:25 AM: $ CI=npm run build. I have walked through all of the suggested steps. 0~prestart: fa-express@0. json is not found in the application root. Run | Edit Configurations, press '+', choose 'npm', specify 'start' as 'Scripts': 2. Runs arbitrary package scripts. Running Binaries Directly. It exists with 1. ` Wrote 1 CSS files to '/Users/MY_DIRECTORY/src' Creating an optimized production build Failed to compile. Start React Native Bundler : select this option to run the bundler automatically, as part of a running or debugging session. 0 -p 9999 -c-1 -o index. The error in NPM, 'error package install failed, see above', can occur when the user creates a new project in Angular using Node. 0` npm ERR! Exit status 137. // package. <br/> npm ERR! This is probably not a problem with npm. js”. In my use case, it makes sense to use “Allow redeploy”, since we keep a latest version on Nexus always updated with the status of the master branch How to Install Node. js:1083:17) at invalidChar npm ERR! code ELIFECYCLE npm ERR! errno 1 npm ERR! felt-pine@0. If any step fails in between, cleaning up incompletely installed packages to start over again might become cumbersome and error-prone. 4. 2. 0 or later. Access to the Windows command line (search > cmd > right-click > run as administrator) OR Windows PowerShell (Search > Powershell > right-click > run as administrator) Note: If you want to install the run-time environment on a different operating system, check out our guide on installing Node. npm ERR! A complete log of this run can be found in: npm ERR! NPM Error "failed to fetch from registry" when Installing Module. 0. npm ERR! error ELIFCYCLE when running npm run dev command My first assumption is, “ oh maybe just update the npm package with ‘npm update’ command and everything should be OK! > Executing task: npm run test < > olproject@1. npm ERR! Tell the author that this fails on your system: npm ERR! Exit status 1 npm ERR! npm ERR! Failed at the magicmirror@ 2. Install live-server: npm install -g live-server; Move your terminal to where your pages live: cd <path-to-content> Start the server: live-server . _load (node:internal/modules/cjs/loader:769:27) at Module. $ npm update express Search a Module. npm ERR! A complete log of this run can be found in: npm ERR! Run npm install or yarn, depending on the package manager you use. npm ERR! This is most likely a problem with the myapp3 package, npm ERR! not with npm itself. js at Function. npmjs. 就可以正常执行了 Update npm Package(s) Updates the package to the latest version, according to the SemVer range specified in package. You can resolve some strange issues by running npm cache clean and trying again. If you have any further problems, feel free to contact me. html" npm ERR! Exit status 1 npm ERR! npm ERR! Failed at the websdk-cdn@1. NORTHAMERICA\Documents\GitHub\SVIChallenge pm-debug. js articles. This will put the grunt command in your system path, allowing it to be run from any directory. Free some disk space or. 0. So, before running these commands please check if you are in the correct directory. If this doesn’t happen, try one of the following workarounds: Check that your file is imported by your entrypoint. TL;DR: So the workarounds are: Run sudo npm run postinstall manually. This means that NPM is corrupted in your system, and must reinstall NPM. Clearing the Cache of your React Native Project. Thus, every time we make updates to any test file, it would re-run our tests. js' at Function. run-electron . Nothing broke for me as far as I can tell. Here is my best guidance for getting Node and npm working using the main Ubuntu repositories: sudo apt-get purge nodejs --auto-remove and sudo apt-get purge npm --auto-remove Using a npm-shrinkwrap. js” “start” npm ERR! node v0. Start the development server using the appropriate command, like npm start or npm run dev. A quick check: run “npm run lalala” in your terminal/command prompt. npm start. 0 start: `concurrently --kill-others "ng serve" "npm run theme"` npm ERR! Exit status 1 npm ERR! npm ERR! Failed at the quickapp-pro@2. 0 start: `react-scripts start`<br/> npm ERR! spawn ENOENT<br/> npm ERR! <br/> npm ERR! Failed at the react-example@0. If there is service which fail to start, you can run SFC /SCANNOW in cmd as administrator to fix the corrupted system components. 后来,在通过源码npm run build正常执行,生成所需要的. The default value is false. 16. js”, then it 1. js:155:19) 4 verbose stack at C:Program Filesnodejsnode_modulesnpmlibrun-script. npm ERR! This is probably not a problem with npm. js sh: 1: webpack: not found npm ERR! file sh npm ERR! code ELIFECYCLE npm ERR! errno ENOENT npm ERR! syscall spawn npm ERR! things-gateway@0. json below: I had this problem too - the top answer on this stackoverflow post sorted me out. Файл package. vue This question is available on Nuxt. thanks again…. #Quick Start. If not, follow the instructions at nodejs. npmjs. First, identify the main file of your application. 1. Computer programs that successfully run exit with the code of 0. 7 v on my server, I get the following error: npm WARN cannot run in wd ghost@0. Run Electron without all the junk terminal output. How to Fix the Error Message Error: npm ERR! Windows_NT 6. 0. js, server. js and npm installed. More Info. min. 9-moby npm … It's some random virus, I'm not sure what it was but I ran Windows Defender and found them. I tried using @DTrejo's suggestion, but it didn't didn't work for me. json file contains the version requirements for the full module dependency chain. less, my CSS file isn't recompiled. Check the spelling of the name, or if a path was included, verify that the path is correct and try again”. Remove the "npm" key from the "engines" in package. I felt as if this was a virus but didn't think one would effect Windows 8 just yet and as far as I could tell at the time the only effect was that it was screwing up rudimentary systems that affected the client/server communication specifically in my educated guess that is. 0. log I get error at npm start with the template ACE repo. 6:20:25 AM: └───────────────────────────────────┘. AggregateException: One or more errors occurred. npm ERR! enoent After I installed the dependency, the NPM run dev console reported an error, and I did not find the reason. Module. 0 node core/server/utils/npm/preinstall. 1. npm ERR! NPM — npm start Error: ENOSPC: System limit for number of file watchers reached. There are many option to do that all over the net including nodejs. org. If there is only one version of nodejs and only one version of npm, and they are both installed using the default repositories, this should work perfectly. js 'NODE_ENV' is not recognized as an internal or external command, operable program or batch file. When i start up my dell it loads past the dell screen my computer asks me weither to load windows normaly or launch windows repair. json. runInTerminal": false, "npm. json, and then use npm stop. This worked for me since version 12. . js and npm Installation # To check that the installation was successful, run the following commands which will print the Node. Once you're finished, you also won't need to use sudo to install npm modules globally. less directly. js and npm by typing: sudo yum install nodejs. json. json since it says Failed to exec dev script. 14393 npm ERR! argv “C:\Program Files odejs ode. When using NPM to install a module for a project, you may encounter a frustrating error like this: $ npm install express --save npm http GET https://registry. #Check for node, npm, and npx 所以导致npm run build的webpack打包失败. 0 start script. Install Python2 * if not installed already. bin custom npm bin name, the default is npm. Building the client side code again. 0. 1. npm run dev I would like to run it each time server restarts so the wite would be constantly up. 1. But when I make changes in js it refresh the page but still dont change anything – ki-code May 10 '20 at 15:00 [email protected] start: `react-scripts start` npm ERR! Exit status 1 npm ERR! npm ERR! Failed at the [email protected] start script. rm -rf node_modules && npm cache clean --force && npm install && npm run dev run the npm prune command to remove unused or not required node packages from Node. If none of these solutions help please leave a comment in this thread. 1. manually creation using text editor; npm init command Pastebin. Pastebin is a website where you can store text online for a set period of time. The NPM program is installed on your computer when you install Node. json to replace electron-dev with: "dev" : "nf start" And now, we can execute: npm run dev UPDATE (1/25/17) : I‘ve added the following section in response to some user comments (here and here). js and npm installed. 1. From the debug file: verbose stack Error: missing script: start. Compile TypeScript : select to run the built-in TypeScript compiler and thus make sure that all the changes you made to your TypeScript code are reflected in the generated JavaScript files. There is likely additional logging output above. Run CHKDSK to scan your computer’s Hard Drive. You can follow the question or vote as helpful, but you cannot reply to this thread. 0. js. 1. /bin/www npm ERR! I got this error Error: Cannot find module 'number-is-nan' whereas the module actually exists. 0. npm. 👍 Exit status 1 npm ERR! npm ERR! Failed at the react-redux-course@1. you will probably have the cause of the error. 0. com is the number one paste tool since 2002. exe” “C:\Program Files odejs ode_modules\npm\bin\npm-cli. json' npm ERR! enoent This is related to npm not being able to find a file. org. 2 start script. There is likely additional logging output above. Its failing to start and here are the logs -----  2019-02-23T07:23:42. Electron spews out a lot of junk terminal output when you run it. 此preact项目再去: npm run build. sh script. js:1:278827 SyntaxError: JSON5: invalid character ' ' at 46:1 const util = require ('. (The NPM script ‘start’ exited without indicating that the Angular CLI was listening for requests. 254416263Z > Project@0 Installing via npm, everything worked well up to the “npm start” command when I received an error. Module not found: Error: Can't resolve 'routes/index. json file. Here is the error: 6:20:25 AM: ┌───────────────────────────────────┐. json npm ERR! errno -4058 npm ERR! enoent ENOENT: no such file or directory, open 'C:\Users\SARKAR\package. right-click your package. Next, install both Node. js port and can successfully run nexxtjs app through . npm ERR! If you do, this is most likely a problem with the webpack-boilerplate package, npm ERR! not with npm itself. No more! I have tried to get the Electron team to fix this, but they are not responding to my issue, nor any others: electron/electron#12185, electron/electron#13008, electron/electron#13502. I recommend you to have a look at the package. Use the application generator tool, express-generator, to quickly create an application skeleton. www. react-mobile-datepicker. 1, even though we just saw that v1. 1~prestart: unsafe-perm in lifecycle true 7 verbose 3. There are two options to solve the problem. Cause. js file. 0 3 info using node@v12. env as the last resort for both Yarn […] If you do, this is most likely a problem with the npm-build package, npm ERR! not with npm itself. npm ERR! A complete log of this run can be found in: npm ERR! C:\Users\KavIran\AppData\Roaming\npm-cache_logs\2019-01-07T19_11_55_005Z-debug. 3 npm ERR! missing script: start npm ERR! npm ERR! If you need help, you may report this You are trying to install on a drive that either has no space, or has no permission to write. 0. The following is an error content. js and NPM with one command: sudo apt install nodejs. 4. There is likely additional logging output above. 0 4 verbose run-script [ 'prestart', 'start', 'poststart' ] 5 info lifecycle fa-express@0. 0-1020-aws npm ERR! argv "node" "/usr/bin/npm" "run" "build" npm ERR! node v8. FoodMeUp@1. so Please make sure you are in the right folder where you are going to enter npm start I get the following error when I launch npm run deploy. 0. 0 start: webpack && node build/gateway. 1. This is exactly the same behavior as npm start, which recompiles our source code when any of our source files are updated. 0. If you want to use chrome-launcher, Travis can install Chrome at run time with an addon. js Command prompt there. npm. mon, I would try the same and let you know. Running Group of Commands. In the NPM Script dialog that opens, specify the npm run/debug configuration settings . I used fedora 24 with dnf to install the default package from the repo. js and npm installed. 0 info it worked if it ends with ok 1 verbose cli [ '/usr/local/bin/node', '/usr/local/bin/npm', 'start' ] 2 info using npm@5. When I run the command 'npm run start-dev' I am getting the warning No Env file found and cannot read property 1 of null. 0 MB total. ” and then it works from there… Once the NodeSource repository is enabled, install Node. If you are behind a corporate proxy, it is likely that this error was caused by your proxy. npm install -g live-server Manual way. In Microsoft Windows XP and in Windows Server 2003, you cannot use the Run as feature to access the logged-on user's mapped home drive. JavaScript is quickly becoming the go-to language for web developers. 6:20:25 AM: bash: run: command not found. To run npm start from pm2 you can run pm2 start npm -- start. Alternatively, if are running Node-RED using the node command, you must provide arguments for the node process before specifying red. js and npm installed. npm ERR! Make sure you have the latest version of node. zip file and tried running the sample app from the “Sample&Libs” directory. js inside that directory and visit http://127. 5 20 error code ELIFECYCLE 21 error errno 1 22 error [email protected] build: tsc 22 error Exit status 1 23 error Failed at the [email protected] build script. 5. Half of Node. npm ERR! This is most likely a problem with the alexa-voice-service-sample-companion-service package, npm ERR! not with npm itself. To do this, you must use the node-red-pi start script in place of node-red. (C:\Users\Gebruiker\AppData\Roaming\npm ode_modules\npm ode_modules\npm-lifecycle\index. I have tried through the systemctl service but I couldn't get it to work. Verify the installation by checking the versions of Node. It was due to a bad/incomplete Node. 0 test C:\Users\PC\Desktop\OLproject > echo "Error: no test specified" && exit 1 "Error: no test specified" npm ERR! code ELIFECYCLE npm ERR! errno 1 npm ERR! olproject@1. It should be in `node_modules/react-scripts/scripts/start. 0. These instructions will have you remove all of those packages. 4 verbose stack Error: missing script: start 4 verbose stack at run (C:Program Filesnodejsnode_modulesnpmlibrun-script. 0. json. This error gives during Below npm command running npm install dependencies locally or globally npm run start - running the project There are no ways we can create a package. npm ERR! Tell the author that this fails on your system: npm ERR! Description Hi guys, I downloaded the Fully customizable web . conf. Hi, I am using nodejs with angularcli and deployed on the Azure app service. Share: So, you need to cd into the directory which holds package. I get the following error/output/log. 2 which requires node 8. 0 start: `react-scripts start` npm ERR! Exit status 1 npm ERR! npm ERR! Failed at the felt-pine@0. json. 2 4 verbose stack Error: missing script: start 4 verbose stack at run (/usr/local/lib/node_modules/npm/lib/run-script. npm ERR! If you do, this is most likely a problem with the webpack-boilerplate package, npm ERR! not with npm itself. 0 start: `ng serve "--port" "58000"` npm ERR! Do you have dev script defined in the package. title = myApp; And, then in scripts. json with "“start-dev”: “nf start -p 3000”. /" its not showing. 14. 8 3 info using node. 0. js:345:5 "scripts": { "test": "echo \"Error: no test specified\" && exit 1", "start": "node App. json npm ERR! code ENOENT npm ERR! errno -4058 npm ERR! syscall open npm ERR! enoent ENOENT: no such file npm start doesn’t detect changes#. npm ERR! Tell the author that this fails on your system: npm ERR! npm ERR! missing script: start npm ERR! npm ERR! If you need help, you may report this error at: npm ERR! https://github. 6:20:25 AM: . react-mobile-datepicker. Running npm install on the host system using the same package. Then NPM run build, and NPM run dev, there are many ERRs on the direct command line. js and NPM. 0 start script. npm ERR code ELIFECYCLE. 2 is available. js if you want to remove devDependencies then run prune command with –production flag npm prune — production=true The above code must be invoked with npm run watch-test, npm watch-test will fail. npm ERR! A complete log of this run can be found in: npm ERR! C:\Users\Nam Tran\AppData\Roaming\npm-cache_logs\2019-09-16T02_52_41_029Z-debug. Run the following command to install all dependencies required to run the TODO-MVC example: Run npm Script: select this option to execute an npm script. If there is a server. In the NPM Script dialog that opens, specify the npm run/debug configuration settings . js:58:5: 5 verbose stack at C:\Program Files odejs ode_modules\npm ode_modules\read-package-json\read-json. npm ERR! It looks like your react-scripts start file disappeared. Then upgrade npm and then node…. 0 deploy D:\Divers\Programmation\Web\foodmeup. There is likely additional logging output above. I don't know what's the different to my old computer. 11. 0 start /root/gateway webpack && node build/gateway. 1 start C:\Users\appp\Downloads\atlassian-connect-express-template > node -r esm app. ) npm run looks for an entry of that name in the scripts field of package. Here are some good resources on npm: Tour of npm; npm Tricks; How to Build a Node npm Package From Scratch 1- Il faut supprimer ces deux dossier : npm et npm-cache. This should read ESM modules in Node. This will run any command that is written within package. log npm ERR! code ELIFECYCLE<br/> npm ERR! syscall spawn<br/> npm ERR! file sh<br/> npm ERR! errno ENOENT<br/> npm ERR! react-example@0. Installation. 1:1337/ License Click windows start button. Npm way. Any help would be greatly appreciated. Try running npm audit fix, which will still leave you with some warnings which can be fixed with npm audit fix --force. _resolveFilename (node:internal/modules/cjs/loader:925:15) at Function. You'll also need to inspect the process. I click normal startup and it then starts to load the windows flag. js (wd=/var/www/ghost) On digging a bit deep, I found that NPM tries to downgrade its privileges when it runs scripts. You can use the --silent flag to prevent showing npm ERR! output on error. 0. 0 mocha: . 0 v node-cluster : 0. /server. git clone https://github. 0 start script. js. json does not have a script An unhandled exception occurred while processing the request. 2 (Reports to # bugs should use the template which includes extra information like the npm version you are running and platform you are on. json “start” script, if one was provided. This is what I did and, once I resolved the issues, it was able to start again. 2. sh npm ERR! Exit status 1 npm ERR! npm ERR! Failed at the things-gateway@0. 6:20:25 AM: │ 1. Pre & Post Scripts To create "pre" or "post" scripts for any scripts defined in the "scripts" section of the package. js morgan deprecated default format: use combined format node_modules\esm\esm. json exists, but node_modules missing, did you mean to install? npm ERR! A complete log of this run can be found in: npm ERR! Hi, I’m installing on Debian 9 minimal server I’m in the step of running npm to configure the gateway root@d9lxc:~/gateway# npm start things-gateway@0. 0 6 info lifecycle fa-express@0. e “start” & “build” that we need in order to host the project on the server and to run the build operation simultaneously. Open localhost:8080 in a browser. My npm is 6. If this has not helped, there are a few other things you can try: Before: npm run clean && npm run build:css && npm run build:js && npm run build:html After: npm-run-all clean build:* Cross platform. npm ERR! If you do, this is most likely a problem with the webpack-boilerplate package, npm ERR! not with npm itself. json file. 15. Any of the commands in node_modules/. npm run clean && npm run build:css && npm run build:js && npm run build:html After: npm-run-all clean build:* compared to using npm run foo & npm run bar. I remember seeing a tutorial before. npm ERR! This is probably not a problem with npm. includeDirectories": [ "subdir1/path", "subdir2/path" ] } Keyboard Shortcuts npm error: nuxt. npm ERR! This is probably not a problem with npm. 之后: 【已解决】如何从项目react-mobile-datepicker的js源码编译并发布js库. 1. Solución: Al parecer es un problema con las versiones de NPM que se instala. js” "start" npm ERR! node v4. You started the application from an IDE and you didn't run npm startor npm run webpack:build. Problem. 0. npm ERR! Failed at the myapp3@0. npmrc file. 0. json” (in the folder in which you run “npm run build”), there’s NO “build” script. Network error message: listen EACCES 0. Is there another way? Am I overlooking something obvious? 0 info it worked if it ends with ok 1 verbose cli [ '/usr/bin/nodejs', '/usr/bin/npm', 'start' ] 2 info using npm. ) Run npm install and check in any changes to the package-lock. 0~start: unsafe-perm in Hi all, I'm trying to run npm run build, but it fails to compile. My project works just fine if I use npm start instead. json file or your project does not contain a server. See full list on webpack. js” npm ERR! things-gateway@0. 6. Question or issue on macOS: All I am doing is running create-react-app and cd’ing into the app, then trying to run npm/yarn start. Once the flag does its spin around it freeze's then restarts and repeats the process over and over a That being so, you should, first and foremost, make sure that the Windows Audio service is started and is set to start as soon as the computer boots up, and see if that fixes the problem. but you only see this error message: npm ERR! missing script: start Solution: You need to tell npm what to do when you run npm start explicitly by editing package. 11 and. --force won't fix it, but if you run npm audit fix again, it will allow you to scroll & update the package manually. 1:1336/amd-test; http://127. There is likely additional logging output above. npm ERR! If you do, this is most likely a problem with the webpack-boilerplate package, npm ERR! not with npm itself. json // Define start and test targets { "name": "death-clock", […] CSDN问答为您找到`npm run start` yields "[webpack-isomorphic-tools] (waiting for the first Webpack build to finish)" and never completes相关问题答案,如果想了解更多关于`npm run start` yields "[webpack-isomorphic-tools] (waiting for the first Webpack build to finish)" and never completes技术问题等相关问答,请访问CSDN问答。 This solution fixes the error caused by trying to run npm update npm -g. Verify the Node. npm ERR! This is probably not a problem with npm. _load (internal/modules/cjs/loader. To use the Run as feature, you click The following user in the Run as dialog box, type a user name in the User name box, and then type a password in Password box. Module. npm start fail due to watch error# It means in your “package. 0 start script. js and NPM on CentOS 7 . 7. exe” “C:\Program Files odejs ode_modules\npm\bin\npm-cli. js:139:12 npm ERR! at cb (/opt/node0610/lib/node_modules/npm/lib/utils/npm-registry-client/request. 2 start /home/pi/MagicMirror > sh run-start. qa-portal@0. 1 6 verbose lifecycle lyricfier. To start using the default registry, remove the two lines which contain registry. I am in the middle section of the tutorial. /util') at syntaxError (C:\Users\appp\Downloads\atlassian-connect-express-template ode_modules\json5\lib\parse. Module. If I run npm run start watch Error Scripts from dependencies can be run with npm explore <pkg> -- npm run <stage>. json"); Hey i tried “CI= npm run build” but it didnt work. 0~start: fa-express@0. step 3: run hash -r then run npm -v o/p : 3. 0. npm ERR! A complete log of this run can be found in: npm ERR! Asked By: Anonymous Here’s the repo. 2. 0 start script. At line:1 char:1 + npm install + ~~~ 5 verbose stack Error: missing script: start: 5 verbose stack at run (C:\Program Files odejs ode_modules\npm\lib\run-script. March 16, 2021 javascript, node. 23 error This is probably not a problem with npm. npm ERR! npm ERR! Failed at the tuna-angular@0. 2. config. From the title you gave, I am guessing you have a line in server. Npm is used in many When we use a npm start command without defining it inside the package. You can make this really simple if you set in app. by default, this is done through react-native start . json, npm ERR! tuna-angular@0. com/tapio/live-server cd live-server npm install # Local dependencies if you want to hack npm install -g # Install globally Usage from command line. Is it still broken for you now? Can you install other packages? (Wondering if you had a transient networking problem, or npmjs did. 2. 1. js:142:19) 5 verbose stack at C:\Program Files odejs ode_modules\npm\lib\run-script. Refer to npm run-script for more details. 0 start script 'react-scripts start'. Create a new npm (hosted) repository and configure it like: The deployment policy “Allow redeploy” above might look somewhat polemic, so you might want to set it to “Disable redeploy”. If you see anything when you run which npm in a terminal, it is. 0 serve script. npm ERR! A complete log of this run can be found in: npm ERR! C:\Users\Lini Eisha\AppData\Roaming\npm-cache_logs\2019-04-29T17_36_59_252Z-debug. 1. 2 start: concurrently "http-server -a 0. 0, you can use custom arguments when executing scripts. 1 4 verbose run-script [ 'prestart', 'start', 'poststart' ] 5 info lifecycle lyricfier. npm start > my-app@0. npm ERR! A complete log of this run can be found in: npm ERR! If any step fails in between, cleaning up incompletely installed packages to start over again might become cumbersome and error-prone. 3 kB each and 1. npm ERR! Tell the author that this fails on your system: npm ERR! node . Alternatively, you can also install Chrome using the download-chrome. Expected a pseudo-class or pseudo-element. yml, use it like so: npm install eslint --save-dev # or yarn add eslint --dev You should then set up a configuration file, and the easiest way to do that is to use the --init flag: $ npx eslint --init # or $ yarn run eslint --init Note:--init assumes you have a package. 4. js` Delete your `node_modules` folder and run `npm install`, then try again. npm ERR! Tell the author that this fails on your system: npm ERR! Thank you @h. Aggregating multiple npm registries under a virtual repository Artifactory provides access to all your npm packages through a single URL for both upload and download. js:957:15) at Function. 4. Pastebin is a website where you can store text online for a set period of time. In my case, I have new app folder in which my-app folder is there so I was confused and thought I am in the correct folder. So if it’s your package, add the “build” script. Then in . ) I tried using the command "forever start -c "npm start" . js and npm installed. You had a network error while running npm install. 3. but when node started with pm2 master node keep sending message. json start section. npm run start is running node server. The Progress NPM registry was retired in favor of npmjs. /config. 0 start script. npm root [-g] Description. npm ERR! A complete log of this run can be found in: npm ERR! Running "npm test" will launch our test runner in watch mode. 9. npm ERR! This is probably not a problem with npm. Failure Logs Output from npm start: > company-admin@0. If any step fails in between, cleaning up incompletely installed packages to start over again might become cumbersome and error-prone. Look for “ALL APPS“, you will see Node. Express application generator. js Command prompt as administrator and soon as its run it will show the message “Your environment has been set up for using Node. Build command from Netlify app │. OR When I tried to run my Application, I got this exception “The NPM script ‘start’ exited without indicating that the Angular CLI was listening for requests” Background: I was working on a project using Angular 5 SPA(Single Page Application) Template in Asp. Description for telesalud Usual error causes. 0. Prints the effective node_modules folder to standard to standard out. json then there you can run your commands like npm install, npm start etc. Random Errors -one place to start . Exit status 1 npm ERR! npm ERR! Failed at the untitled@0. log Execution of "npm run build" causes an error and can not be completed. As of npm@2. npm ERR! If you do, this is most likely a problem with the magicmirror package, npm ERR! not with npm itself. js and npm you also need webpack@4 with a few additional packages to use the framework. json which can be run with npm start or npm test, but npm scripts can do a lot more than simply start servers and run tests. js. They need access to Electron from within # Stop CNCjs in PM2 pm2 stop cnc # Update CNCjs # sudo npm update -g cncjs --unsafe-perm # Tends to fail to update CNCjs, so we will reinstall CNCjs will the command bellow (no settings will be lost) sudo npm install -g cncjs --unsafe-perm # Install CNCjs again, if this fails or causes issue then run (sudo npm uninstall -g cncjs; sudo npm npm can manage packages that are local dependencies of a particular project, as well as globally-installed JavaScript tools. 0 start script. It will work successfully without any errors. js Exit status 126 npm ERR! npm ERR! Failed at the html5-fundamentals@1. The error output was: The serve command requires to be run in an Angular project, but a project definition could not be found. 1 prepublish script ‘npm test && builder run build-dist && npm run copy-lib’. 1 start > node . hi, i have a big problem with ionic. This ensures that the next time you run npm start, the watcher uses the polling mode, as necessary inside a VM. It looks like they updated the referenced endpoints in later versions of the toolbelt, but neglected to update any of the dev dependencies in any of their base templates or in wright framework. Update package. 0). npm ERR! A complete log of this run can be found in: npm ERR! npm ERR! Make sure you have the latest version of node. 0. js:114:5 4 verbose stack at when i run node with npm start command. js:61:5 4 verbose stack at /usr/local/lib/node_modules/npm/node_modules/read-package-json/read-json. msc into the Run dialog and press Enter. 12 info lifecycle test11@0. It will work successfully without any errors. argv array to get the command line arguments. npm ERR! A complete log of this run can be found in: npm ERR! NPM is a package manager for Node. Net Core 2. 3. start and test are a reserved keyword in npm scripts. The npm-shrinkwrap. We use create-react-app v. There is likely additional logging output above. Screenshot of the error being thrown after running the npm start command. 0 (x64) and npm. Then, afterwards, running npm install in the app directory will automatically install modules in the dependencies list. production. js and npm installed. 0 npm ERR! code ELIFECYCLE npm ERR! errno 1 npm ERR! photo-gallery@0. js 6. npm ERR! npm ERR! Failed at the ViroCodeSamples@0. Alternatively you can add the path to serve as a command line parameter. 2. npm ERR! code ELIFECYCLE npm ERR! errno 1 npm ERR! bpmn-js@8. dev>npm run deploy. The scripts in the NPM package are not usable in the browser. The buildpack will simply use the version of npm that comes with your set version of Node. 4. npm ERR! A complete log of this run can be found in: npm ERR! /home/user/. json file already. When prompted to import the repository GPG key, type y, and press Enter. It also means that all you need to do to get an npm-based project up and running is to make sure you have node+npm on your system, clone the git repo, and do npm it to run install and test. Also, are you looking directly at your built index. Set the tmp folder somewhere with more space: npm config set tmp /path/to/big/drive/tmp or. npm will re-install Underscore v1. The naming convention in npm uses a colon to group a whole set of specific tasks. 0 start script. npm ERR! If you do, this is most likely a problem with the callcenter package, npm ERR! not with npm itself. (One or more errors occurred. Try running Node with the --experimental-modules flag. 0 npm ERR! code ELIFECYCLE npm ERR! errno 1 npm ERR! client @0. All the above examples consists of running scripts that are declared in package. If there is no file called “server. It’s simply the example provide by Material-UI with an extra input component in pages/index. js or app. The code runs fine with npm start on localhost but whenever I try build/deploy the project I get the following: If no "start" property is specified on the "scripts" object, it will run node server. re Hello 🙂 My first post, been reading a lot of topic here from month. npm/_logs/2020-07-27T05_56_13_752Z-debug. 24 verbose exit [ 1, true ] and seems related to package. You can run node server. Note that you can run any Unix or Windows command line app from the task. js 12. You need node. sh' . system closed October 19 Now, whenever you run npm run build, it will trigger all the commands, making sure they were called in a correct order. level 2. 0. js and the arguments you want passed to Node-RED itself. Npm-root. [ERROR] npm ERR! If you do, this is most likely a problem with the zeppelin-web package, [ERROR] npm ERR! not with npm itself. If none of the solutions listed and described above work for you, you might want to try running CHKDSK to scan your computer’s Hard Drive for problems and fix any that are found since Hard Drive issues can also cause this problem. json file. ) SemVer ranges are typically specified using "~" or "^". js and npm versions. json file and find the proper build script(it can be npm start, npm run serve etc. js installation. The error also tells us that the missing content is in regards to the start command. try running ‘npm run tsc’ to see if TypeScript is encountering any errors in your code. While the package. js installation. Getting started with PM2 is straightforward, it is offered as a simple and intuitive CLI, installable via NPM. js:840:27) When I ssh into the pi and run npm start, I get the following error: pi@raspberrypi:~/MagicMirror $ npm start > magicmirror@2. Why? 2. If you are fighting with the same here is the solution. 0 start: react-scripts start 13 verbose stack Exit status 1 13 verbose stack at EventEmitter. com from your . 0 start: nps "build" npm ERR! Exit status 2 npm ERR! npm ERR! Failed at the SpurtCommerce@3. json имеет eslintConfig If you try to run a script without having a node_modules directory and it fails, you will be given a warning to run npm install, just in case you've forgotten. json. You should probably install this globally. js version 8. There is likely additional logging output above. I am getting the following error when I run npm start after doing. If found, it will look for a script with the key start and run the command specified as its value. npm ERR! Tell the author that this fails on your system: npm ERR! npm test && builder run build-dist && npm run copy-lib npm ERR! You Hi All, I just completed a macro for work that essentially does a looped check between two lists, the lists contain 5 columns worth of data and the macro compares and matches the lists together. 16. json but this is not required. js is installed. But today, I can’t find This command works, but after that, I am trying to run the command npm start & git bash throws this error: 'Aaroosh\AppData\Roaming pm\' is not recognized as an internal or external command, operable program or batch file. ) Launch the HTTP server (npm run serve-tests) and visit http://127. 5. 0 build: ` react-scripts build ` npm ERR! Exit status 1 npm ERR! npm ERR! Failed at the client @0. org to install. 0 mocha script. Module. 0. If you've previously installed gulp globally, run npm rm --global gulp before following these instructions. npm ERR! Make sure you have the latest version of node. js using VS code. But “npm start” shows the following error: errorno: ENOENT code: ENOENT i can’t seem to find any specific reason for the exception. npm start npm ERR! missing script: start npm ERR! A complete log of this run can be found in: npm ERR! /Users/saigowtham/. 0. json file. There's actually a lot more to npm that I haven't covered. js and npm installed. Most often it is called index. Here is the error: > react-scripts build Creating an optimized production build Failed to compile. 0+ npm 5. 0 start script. Run the commands: nodejs --version npm –version Usual error causes. js and npm. Check the spelling of the name, or if a path was included, verify that the path is correct and try again. Artifactory provides full support for managing npm packages and ensures optimal and reliable access to npmjs. Set one of the above in your package. 1~prestart: lyricfier. npm ERR! This is probably not a problem with npm. You started the application from an IDE and you didn't run npm start or npm run webpack:build. dev NODE_ENV=production webpack -p --config webpack. [25] npm ERR! Make sure you have the latest version of node. js community (#c1932) It works fine for me. Front-end web developers use JavaScript to add user interface enhancements, add interactivity, and talk to back-end web services using AJAX. I cannot create a new project. 3. Example { "npm. 0~start: Failed to exec start script 13 verbose stack Error: test11@0. json file; with earlier versions of npm, you must specify the --save option explicitly. Yes, npm provides for a stop script too: npm help npm-scripts. 9 npm ERR! path C:\Users\laton\package. json completes successfully Actual behavior npm ERR! Linux 4. ``` Solution to the problem -> After running “npm start” execution got stuck on starting/running packager. 3. js:142:19) Attachments: Up to 2 attachments (including images) can be used with a maximum of 524. That means something has gone wrong: we have no tests. com is the number one paste tool since 2002. 10. json file scripts object we will see the following error in our terminal. 1. D:\Divers\Programmation\Web\foodmeup. 0. com to delete if infringement. (This comes by default with Node 12 and 14. 0 start D:\Qa_portal\qa-portal react-scripts start 'react-scripts' is not recognized as an internal or external command, operable program or batch file. npm ERR! This is probably not a problem with npm. 0 start: react-scripts start npm ERR! Exit status 1 npm ERR! npm ERR! Failed at the react-test@0. com/npm/npm/issuesnpm ERR! Please include the following file with any support request: npm ERR! C:\Users\andrmoll. 19 verbose npm v6. Windows Linux Run npm Script: select this option to execute an npm script. First, NPM run dev runs the program, port 3000. jsx' in '/Users/MY_DIRECTORY/src' npm ERR! code ELIFECYCLE npm ERR! errno 1 Ожидаемое поведение команда npm start (или npm run start) запускает приложение. _resolveFilename (internal/modules/cjs/loader. 1. 12. Pastebin. Here is a typical package. (base) tayloraishman@MacBook-Pro ~ % npm run start Seems to suggest you're still in your users' root, so provided you've already cloned it the repo, possible into your users' root, just do cd ~/streetmerchant npm ERR! code ELIFECYCLE npm ERR! errno 1 npm ERR! react-test@0. 1 verbose cli [ '/usr/bin/node', '/usr/bin/npm', 'start' ] 2 info using npm@6. In a CI environment like Travis, Chrome may not be installed. Since By default with version npm 5. Please contact javaer101@gmail. 9. 0. step 2: run which npm o/p: /usr/bin/npm. json and change the version of the dependency to be updated and run the following command. 0 7 verbose lifecycle fa-express@0. enableTouchbar Enable the npm scripts on macOS touchbar. 4. There is likely additional logging output above. 11. js npm start npm start — runs the package. js, process. My guess is that directory and/or file was not generated (probably a bug in the generator) or you deleted it because you didn't think it was important. Make sure you have the latest version of node. runSilent run npm commands with the --silent option, the default is false. json file is an attempt to address the module versioning limitations of the package. Hi Today I'm programming on an other computer. Npm-run-script. When we run npm start it took some time as per your CPU and RAM configuration but in some cases, it took more than an hour which is a problem. npm/_logs/2021-02-09T13_27_46_480Z-debug. 7. NPM is an abbreviation of Node Package Modules. 0. This thread is locked. js. npm ERR! This is probably not a problem with npm. I’m really new to all this stuff (1 year xp junior front end dev), so be nice with me 🥰 First thanks a lot, you guys saved my life and enormous debugging time(I especially thanks the guy with avatar of a big beard and square glasses, sorry I don’t remember your name but 1000 thanks to you). 0. npm ERR! websdk-cdn@1. 9. 1:1336/browser-test; http://127. log. There is one last issue that needs to be manually fixed. In Excel, choose the Home tab, and then choose the Show Taskpane button in the ribbon to open the add-in task pane. Linux 5. Finally, we’ll change the run targets in package. json , simply create another script with a matching name and add "pre" or "post" to the beginning of them. 1. 0. npm ERR! A complete log of this run can be found in: npm ERR! step 1: run npm -v o/p : Error: bash: /usr/local/bin/npm: No such file or directory. 1+ (note: some npm 5+ versions were known to cause problems, especially with deduplicating packages; upgrade npm when in doubt) Besides Node. npm ERR! (The NPM script 'start' exited without indicating that the Angular CLI was listening for requests. There is likely additional logging output above. npm ERR! code ELIFECYCLE npm ERR! errno 1 npm ERR! WebApplication6@0. In most cases, this should be enough to fix the problem. 0. 1. npm ERR! This is probably not a problem with npm. bin can be invoked with npm run. 1. telerik. The latest PM2 version is installable with NPM or Yarn: For more information run npm help json and look for the "bin" section. It looks like you might not have defined a start script in your package. 1 prestart script. js and Node. 0+ npm install adds the module to the dependencies list in the package. js which you know works and try again. In one of the code examples above, we run all lint tasks in parallel using & syntax. 2 npm ERR! npm v4. Install Python2 * if not installed already. There is likely additional logging output ab npm WARN Local package. when i try to run npm start i get following error ‘SINGLE_START’ is not recognized as an internal or external command, operable program or batch file. 4. js to run application instead we can npm script − npm start. 4 verbose stack at run (C:\Program Files odejs ode_modules pm\lib\run-script. 0 start script. npm ERR! This is probably not a problem with npm. org/express npm ERR! Error: failed to fetch from registry: express npm ERR! at /opt/node0610/lib/node_modules/npm/lib/utils/npm-registry-client/get. npm ERR! Tell the author that this fails on your system: npm ERR! npm test npm ERR! code ELIFECYCLE npm ERR! errno 1 npm ERR! blog@0. This prints out "Error: no test specified" and then the Unix exit command gets ran with the number 1 as an argument. Synopsis. For Windows you need a clean Node installation : Uninstall Node. js. 1 start: `ng serve --proxy-config proxy. Exit status 8 npm ERR! npm ERR! Failed at the alexa-voice-service-sample-companion-service@1. I have tried un/reinstalling npm, node, and vue. json file. Synopsis. 1. js® and NPM on Windows. There is likely additional logging output above. npm run start:web To use your add-in, open a new workbook in Excel on the web and then sideload your add-in by following the instructions in Sideload Office Add-ins in Office on the web . log. Reports to # support are more freeform and I have moved your issue there. There is likely additional logging output above. Hi there, it looks like you have to update your node version on your computer. 0 3 info using node@v6. com hosts thousands of free packages to download and use. Failed at the react-box@0. Before you start, make a note of any globally installed npm packages. log. This means that I can invoke mocha by running npm run Verify that Node. 14. The CKEditor 5 Framework is made of several npm packages. 04 on GCP instance node : 10. Compile TypeScript : select to run the built-in TypeScript compiler and thus make sure that all the changes you made to your TypeScript code are reflected in the generated JavaScript files. But i understand that once npm is installed as a package manager then it should be done by npm itself. 2 start script 'sh run-start. Welcome to the PM2 Quick Start! PM2 is a daemon process manager that will help you manage and keep your application online. npm ERR! This is probably not a problem with npm. npm ERR! This is probably not a problem with npm. js:63:5 Run npm Script: select this option to execute an npm script. You want to run a NodeJS app using. now i am learning npm cli command before anything. npm ERR! This is probably not a problem with npm. There is likely additional logging output above. 0 build script ' react-scripts build '. js which is failing. 0. GitHub Gist: instantly share code, notes, and snippets. when I type: ionic start myApp tabs, I have this answer: C:\Users\USER\Desktop\application>ionic start myApp tabs Pick a framework! C:\Users\SARKAR>npm start npm ERR! code ENOENT npm ERR! syscall open npm ERR! path C:\Users\SARKAR\package. npm. There is likely additional logging output above. json file only includes versions for the top-level modules, the npm-shrinkwrap. 1. sudo npm cache clean -f sudo npm install -g n sudo n stable Posterior a ello se refresca. ces deux dossiers se trouvent dans les chemins suivants: C:\Users\xxx\AppData\Roaming\npm, C:\Users\xxx\AppData\Roaming\npm-cache 2- Après avoir supprimer les deux dossiers précédents, taper cette commande sur votre terminal: ```npm install -g npm@latest Method 9. npm ERR! Make sure you have Make sure that you're running npm >= 6 on your local machine. js It means you’re using a version of node that doesn’t recognize ES2015 module syntax and, either your code or somewhere in your dependency tree, a module uses that syntax. We sometimes use & to run multiple command in parallel, but cmd. npm ERR! This is probably not a problem with npm. See serve as an example server: build your app, then run serve from inside the /dist folder that the app was built to. js; Delete the two folders npm and npm_cache in C:\Users\user\AppData\Roaming; Restart Windows and install Node. prestop, stop, poststop: Run by the npm stop command. npm run start error